Motel
type: AccommodationTypology
type: Concept
has rank order: 4
notation: A.2.1.1
definition: I motels differiscono dagli alberghi per la loro particolare predilezione, generalmente accentuata dalla posizione in cui sorgono, per soste di breve durata (automobili, tir, imbarcazioni) e per i servizi di assistenza, riparazione e rifornimento di carburante che offrono alla propria clientela. @it
in scheme: accommodation-typology
broader transitive: A2
broader: A21