Albergo Diffuso
type: AccommodationTypology
type: Concept
alternative label: Alberghi diffusi
broader: A51
broader transitive: A5
definition: Gli alberghi diffusi sono quelle strutture ricettive che offrono alloggio in edifici separati ma solitamente vicini tra loro nei quali i tipici servizi di ricevimento e portineria vengono offerti di un edificio centrale collocato a breve distanza.
in scheme: accommodation-typology
notation: A.5.1.1
related match: Hotel
has rank order: 4