Affittacamere
type: AccommodationTypology
alternative label: Affitta Camere
alternative label: esercizi di affittacamere
notation: B.1.1.1
broader: B11
preferred label: Guest House @en
broader transitive: B1
type: Concept
definition: Gli esercizi di affittacamere sono strutture ricettive con camere, nelle quali oltre all'alloggio possono essere forniti anche servizi complementare, dislocate in più appartamenti mobiliati ma ubicate nello stesso stabile.
has rank order: 4
in scheme: accommodation-typology