Residenza d'epoca extraalberghiera
type: AccommodationTypology
definition: Le residenze d'epoca sono strutture ricettive extralberghiere ubicate in complessi immobiliari di particolare pregio storico e architettonico, dotate di mobili e arredi d'epoca o di particolare livello artistico, idonee ad una accoglienza altamente qualificata.
notation: B.1.1.5
type: Concept
has rank order: 4
broader transitive: B1
broader: B11
in scheme: accommodation-typology
preferred label: Extra Hotel Residence @en