Alloggio in ambito di attività agrituristica
type: Concept
has rank order: 4
in scheme: accommodation-typology
definition: Gli alloggi nell'ambito delle attività agrituristiche sono locali siti in fabbricati rurali gestiti da imprenditori agricoli ai sensi della legge 20 febbraio 2006, n. 96, recante disciplina dell'agriturismo.
preferred label: Accommodation in the agritourism sector @en
broader: B12
broader transitive: B1
type: AccommodationTypology
notation: B.1.2.1