Ostello per la gioventù
type: AccommodationTypology
type: Concept
alternative label: Casa per la gioventù
alternative label: Case per la gioventù
alternative label: Ostelli per la gioventù
alternative label: Ostello
broader: B1
broader transitive: BC
definition: Gli ostelli per la gioventu' sono strutture ricettive per il soggiorno e il pernottamento, per periodi limitati, dei giovani e dei loro accompagnatori, gestite, in forma diretta o indiretta, da enti o associazioni.
in scheme: accommodation-typology
narrower: B131
notation: B.1.3
preferred label: Youth Hostel @en
has rank order: 3