Casa per ferie
type: Concept
type: AccommodationTypology
alternative label: Case per ferie
has rank order: 4
definition: Le case per ferie sono strutture ricettive attrezzate per il soggiorno di persone o gruppi e gestite, al di fuori di normali canali commerciali, da enti pubblici, operanti senza fine di lucro per il conseguimento di finalita' sociali, culturali, assistenziali o sportive, nonche' da enti o aziende per il soggiorno dei propri dipendenti e loro familiari. Nelle case per ferie possono altresì essere ospitati dipendenti e relativi familiari, di altre aziende o assistiti dagli enti di cui al presente comma con i quali sia stata stipulata apposita convenzione.
in scheme: accommodation-typology
notation: B.1.4.1
broader: B14
broader transitive: B1
preferred label: Holiday House @en