Rifugio escursionistico
type: AccommodationTypology
type: Concept
alternative label: Rifugi escursionistici
broader: B15
broader transitive: B1
definition: I rifugi escursionistici sono strutture ricettive aperte al pubblico idonee ad offrire ospitalita' e ristoro ad escursionisti in zone montane ubicate in luoghi favorevoli ad ascensioni, servite da strade o da altri mezzi di trasporto ordinari, anche in prossimità di centri abitati ed anche collegate direttamente alla viabilità pubblica.
in scheme: accommodation-typology
notation: B.1.5.1
preferred label: Hiking Refuge @en
has rank order: 4