Rifugio alpino
type: AccommodationTypology
type: Concept
alternative label: Rifugi
alternative label: Rifiugi alpini
broader: B15
broader transitive: B1
definition: I rifugi alpini sono strutture ricettive ubicate in montagna, ad alta quota, fuori dai centri urbani. I rifugi alpini sono predisposti per il ricovero, il ristoro e per il soccorso alpino e devono essere custoditi e aperti al pubblico per periodi limitati nelle stagioni turistiche. Durante i periodi di chiusura i rifugi alpini devono disporre di un locale per il ricovero di fortuna, convenientemente dotato, sempre aperto e accessibile dall'esterno anche in caso di abbondanti nevicate e durante il periodo di apertura stagionale il servizio di ricovero deve essere comunque garantito per l'intero arco della giornata.
in scheme: accommodation-typology
notation: B.1.5.2
preferred label: Alpine Refuge @en
has rank order: 4