Attività ricettive in residenze rurali o country house
type: AccommodationTypology
type: Concept
alternative label: Residenza rurale
alternative label: Residenze rurali
preferred label: Country House
alternative label: Esercizi rurali
broader: B16
broader transitive: B1
definition: Le attivita' ricettive in residenze rurali o country house sono le strutture localizzate in ville padronali o fabbricati rurali da utilizzare per l'animazione sportivo-ricreativa composte da camere con eventuale angolo cottura, che dispongono di servizio di ristorazione aperto al pubblico.
in scheme: accommodation-typology
notation: B.1.6.1
has rank order: 4