Bed & Breakfast - family form
type: Concept
type: AccommodationTypology
alternative label: Bed & Braakfast
broader: C11
broader transitive: C1
definition: I bed and breakfast sono strutture ricettive a conduzione ed organizzazione familiare, gestite da privati in forma non imprenditoriale, che forniscono alloggio e prima colazione utilizzando parti della stessa unità immobiliare purché funzionalmente collegate e con spazi familiari condivisi. @it
in scheme: accommodation-typology
notation: C.1.1.1
preferred label: Bed & Breakfast a conduzione familiare @it
has rank order: 4