Campeggio
type: Concept
alternative label: campeggi
has rank order: 4
alternative label: Camping
notation: D.1.1.1
preferred label: Campground @en
type: AccommodationTypology
broader transitive: D1
in scheme: accommodation-typology
broader: D11
definition: Sono campeggi le strutture ricettive aperte al pubblico, a gestione unitaria, allestite ed attrezzate su aree recintate destinate alla sosta ed al soggiorno di turisti in prevalenza provvisti di propri mezzi mobili di pernottamento. In alternativa alla dizione di campeggio può essere usata quella di camping.