Parco Vacanze
type: AccommodationTypology
type: Concept
alternative label: parchi di vacanza
broader: D21
broader transitive: D2
definition: Sono parchi di vacanza i campeggi, a gestione unitaria, in cui è praticato l'affitto della piazzola ad un unico equipaggio per l'intera durata del periodo di apertura della struttura. 8. Le strutture ricettive all'aperto sono classificate in base ai requisiti e alle caratteristiche posseduti secondo le prescrizioni previste dalle regioni e dalle province autonome di Trento e di Bolzano.
in scheme: accommodation-typology
notation: D.2.1.1
preferred label: Holiday Park @en
has rank order: 4