Roccaforte
type: Concept
notation: A.4
broader: https://w3id.org/italia/controlled-vocabulary/classifications-for-culture/cultural-interest-places/A
alternative label: Rocca
alternative label: Rocche
definition: Si distingue dalla Fortezza in quanto sempre costruita in cima a un'altura
in scheme: cultural-interest-places
has rank order: 2