Roccaforte
type: Concept
alternative label: Rocca
alternative label: Rocche
broader: A
definition: Si distingue dalla Fortezza in quanto sempre costruita in cima a un'altura
in scheme: cultural-interest-places
notation: A.4
has rank order: 2