Circolo sportivo
type: Concept
broader: https://w3id.org/italia/controlled-vocabulary/classifications-for-culture/cultural-interest-places/I
alternative label: Circoli sportivi
notation: I.6
has rank order: 2
definition: Il concetto di palestra potrebbe rientrare in questa voce
in scheme: cultural-interest-places