Circolo sportivo
type: Concept
alternative label: Circoli sportivi
broader: I
definition: Il concetto di palestra potrebbe rientrare in questa voce
in scheme: cultural-interest-places
notation: I.6
has rank order: 2