Marcato
type: Concept
alternative label: Mercati
broader: https://w3id.org/italia/controlled-vocabulary/classifications-for-culture/cultural-interest-places/L
has rank order: 2
notation: L.1
definition: Ricomprende i mercati rionali, i mercati comunali, i mercati al coperto
in scheme: cultural-interest-places