Marcato
type: Concept
alternative label: Mercati
broader: L
definition: Ricomprende i mercati rionali, i mercati comunali, i mercati al coperto
in scheme: cultural-interest-places
notation: L.1
has rank order: 2