algebra
type: Concept
notation: 001.002
broader: https://w3id.org/italia/controlled-vocabulary/classifications-for-culture/subject-disciplines/001
has rank order: 2
in scheme: subject-disciplines
definition: Il settore include competenze e ambiti di ricerca relativi all'Algebra, e in particolare allo studio delle proprietà e della classificazione delle strutture algebriche, sia commutative sia non commutative, inclusi gli aspetti e le tecniche computazionali utili per la loro trattazione. Studia altresì la Teoria algebrica dei Numeri. Le competenze didattiche di questo settore riguardano anche tutti gli aspetti istituzionali della matematica di base.
editorial note: Fonte: Decreto Ministeriale 4 ottobre 2000 [In rete] http://attiministeriali.miur.it/anno-2000/ottobre/dm-04102000.aspx (26 febbraio 2018)
related match: http://thes.bncf.firenze.sbn.it/termine.php