geometria
type: Concept
has rank order: 2
preferred label: geometry @en
in scheme: subject-disciplines
editorial note: Fonte: Decreto Ministeriale 4 ottobre 2000 [In rete] http://attiministeriali.miur.it/anno-2000/ottobre/dm-04102000.aspx (26 febbraio 2018)
definition: Il settore include competenze e ambiti di ricerca relativi alla Geometria, e in particolare allo studio delle proprietà e della classificazione delle strutture geometriche e delle varietà topologiche, algebriche, differenziali e analitiche (reali e complesse). Più in generale, studia la Geometria in tutti i suoi aspetti, inclusi quelli combinatori, computazionali e descrittivi, e la Topologia (generale, algebrica e differenziale). Le competenze didattiche di questo settore riguardano anche tutti gli aspetti istituzionali della matematica di base.
broader: https://w3id.org/italia/controlled-vocabulary/classifications-for-culture/subject-disciplines/001
notation: 001.003
related match: http://thes.bncf.firenze.sbn.it/termine.php