probabilità e statistica matematica
type: Concept
broader: https://w3id.org/italia/controlled-vocabulary/classifications-for-culture/subject-disciplines/001
related match: http://thes.bncf.firenze.sbn.it/termine.php
preferred label: probability and statistics @en
alternative label: calcolo delle probabilità
in scheme: subject-disciplines
has rank order: 2
definition: Il settore include competenze e ambiti di ricerca relativi allo studio, dal punto di vista sia teorico sia applicativo, del Calcolo delle Probabilità delle tecniche stocastiche a esso connesse e della Statistica matematica. Studia altresì gli aspetti stocastici delle teorie dell'affidabilità, delle code, delle decisioni e dei giochi. Le competenze didattiche di questo settore riguardano anche tutti gli aspetti istituzionali della matematica di base.
notation: 001.006
editorial note: Fonte: Decreto Ministeriale 4 ottobre 2000 [In rete] http://attiministeriali.miur.it/anno-2000/ottobre/dm-04102000.aspx (26 febbraio 2018)