fisica matematica
type: Concept
notation: 001.007
related match: http://thes.bncf.firenze.sbn.it/termine.php
preferred label: mathematical physics @en
has rank order: 2
editorial note: Fonte: Decreto Ministeriale 4 ottobre 2000 [In rete] http://attiministeriali.miur.it/anno-2000/ottobre/dm-04102000.aspx (26 febbraio 2018)
definition: Il settore include competenze e ambiti di ricerca relativi allo studio, dal punto di vista sia teorico sia applicativo, della Fisica matematica, della Meccanica razionale e più in generale dei Sistemi dinamici, utilizzando tecniche sia analitiche sia geometriche. Studia altresì le teorie relativistiche nei loro aspetti fisico-matematici. Le competenze didattiche di questo settore riguardano anche tutti gli aspetti istituzionali della matematica di base.
broader: https://w3id.org/italia/controlled-vocabulary/classifications-for-culture/subject-disciplines/001
in scheme: subject-disciplines