analisi numerica
type: Concept
preferred label: numerical analysis @en
editorial note: Fonte: Decreto Ministeriale 4 ottobre 2000 [In rete] http://attiministeriali.miur.it/anno-2000/ottobre/dm-04102000.aspx (26 febbraio 2018)
broader: https://w3id.org/italia/controlled-vocabulary/classifications-for-culture/subject-disciplines/001
definition: Il settore include competenze e ambiti di ricerca relativi allo studio, dal punto di vista sia teorico sia applicativo, dell'Analisi numerica e delle tecniche utilizzate per effettuare calcoli numerici e grafici, anche con l'uso di elaboratori elettronici, inclusi quelli vettoriali e paralleli. Più in generale, studia gli aspetti computazionali della matematica in tutte le loro articolazioni. Le competenze didattiche di questo settore riguardano anche tutti gli aspetti istituzionali della matematica di base.
in scheme: subject-disciplines
has rank order: 2
notation: 001.008
related match: http://thes.bncf.firenze.sbn.it/termine.php