ricerca operativa
type: Concept
related match: http://thes.bncf.firenze.sbn.it/termine.php
definition: La ricerca operativa studia i processi decisionali nei sistemi organizzati, nonché i modelli e i metodi per prevedere il comportamento di tali sistemi, in particolare quelli relativi alla crescita della loro complessità, per valutare le conseguenze di determinate decisioni e per individuare le decisioni che ottimizzano le loro prestazioni. Le metodologie di base comprendono la teoria e gli algoritmi di ottimizzazione, la teoria dei grafi e delle reti di flusso, la teoria dei giochi e delle decisioni. I problemi oggetto di studio comprendono i sistemi di produzione, trasporto, distribuzione e supporto logistico di beni e servizi, la pianificazione, organizzazione e gestione di attività, progetti e sistemi, in tutte le diverse fasi che caratterizzano il processo decisionale: definizione del problema, sua formalizzazione matematica, formulazione di vincoli, obiettivi e alternative di azione, sviluppo di algoritmi di soluzione, valutazione, implementazione e certificazione delle procedure e delle soluzioni trovate. Le competenze didattiche di questo settore riguardano anche tutti gli aspetti istituzionali della matematica di base.
notation: 001.009
has rank order: 2
in scheme: subject-disciplines
editorial note: Fonte: Decreto Ministeriale 4 ottobre 2000 [In rete] http://attiministeriali.miur.it/anno-2000/ottobre/dm-04102000.aspx (26 febbraio 2018)
broader: https://w3id.org/italia/controlled-vocabulary/classifications-for-culture/subject-disciplines/001
preferred label: operational research @en