fisica teorica, modelli e metodi matematici
type: Concept
alternative label: fisica teorica
broader: 003
definition: Comprende le competenze necessarie alla trattazione teorica dei fenomeni fisici, partendo da principi e da leggi fondamentali e con l'ausilio di adeguati strumenti matematici e computazionali, nonché le competenze atte all'approfondimento applicativo della matematica finalizzato alla investigazione, alla trattazione teorica e alla modellistica dei fenomeni fisici. Le competenze di questo settore riguardano anche la ricerca nei campi dei fondamenti della fisica, dei sistemi dinamici, degli aspetti statistici dei sistemi fisici complessi, della relatività speciale e generale e delle teorie relativistiche.
editorial note: Fonte: Decreto Ministeriale 4 ottobre 2000 [In rete] http://attiministeriali.miur.it/anno-2000/ottobre/dm-04102000.aspx (26 febbraio 2018)
in scheme: subject-disciplines
notation: 003.002
preferred label: theoretical physics, mathematical models and methods @en
related match: http://thes.bncf.firenze.sbn.it/termine.php
has rank order: 2