fisica della materia
type: Concept
alternative label: material physics @en
broader: 003
definition: Comprende le competenze necessarie alla trattazione teorica e sperimentale degli stati di aggregati sia atomici sia molecolari, nonché le competenze atte alla trattazione delle proprietà di propagazione e interazione dei fotoni con i campi e con la materia. Le competenze di questo settore riguardano anche la ricerca nei campi della fisica atomica e molecolare, degli stati liquidi e solidi, dei composti e degli elementi metallici e semiconduttori, degli stati diluiti e dei plasmi, nonché della fotonica, dell’ottica, dell’optoelettronica e dell’elettronica quantistica.
editorial note: Fonte: Decreto Ministeriale 4 ottobre 2000 [In rete] http://attiministeriali.miur.it/anno-2000/ottobre/dm-04102000.aspx (26 febbraio 2018)
in scheme: subject-disciplines
notation: 003.003
preferred label: physics of matter @en
related match: fisica della materia
has rank order: 2