fisica nucleare e subnucleare
type: Concept
broader: 003
definition: Comprende le competenze necessarie allo studio, da un punto di vista sia teorico sia sperimentale, dei fenomeni nucleari, subnucleari, spettroscopici, dei fenomeni riguardanti le particelle costituenti e le loro interazioni fondamentali nonché le competenze necessarie all'investigazione degli sviluppi tecnologici e strumentali connessi. Le competenze di questo settore riguardano anche la ricerca nei campi della fisica legata ai reattori nucleari e alle sorgenti radiogene in genere, nonché nei campi dell’elettronica nucleare, della radioattività e della fisica delle particelle di origine cosmica.
editorial note: Fonte: Decreto Ministeriale 4 ottobre 2000 [In rete] http://attiministeriali.miur.it/anno-2000/ottobre/dm-04102000.aspx (26 febbraio 2018)
in scheme: subject-disciplines
notation: 003.004
preferred label: nuclear and subnuclear physics @en
related match: http://thes.bncf.firenze.sbn.it/termine.php
related match: fisica nucleare
has rank order: 2