astronomia e astrofisica
type: Concept
alternative label: astrofisica
alternative label: astronomia
broader: 003
definition: Comprende le competenze necessarie allo studio sia teorico sia osservativo dei fenomeni astronomici e astrofisici e cioè dei corpi celesti e dei sistemi di corpi celesti, della cosmologia, della fisica dei sistemi autogravitanti e della gravitazione soprattutto nei suoi aspetti classici, statistico-meccanici e computazionali, nonché della fisica spaziale e cosmica. Comprende anche le competenze atte allo sviluppo di metodologie e tecnologie innovative, osservative e computazionali, finalizzate all'approfondimento delle conoscenze specifiche. Le competenze di questo settore riguardano pure la ricerca nei campi della fisica del mezzo interstellare e intergalattico, dello studio dei fenomeni emissivi ad alte energie nonché dei metodi matematici e computazionali specifici del settore.
editorial note: Fonte: Decreto Ministeriale 4 ottobre 2000 [In rete] http://attiministeriali.miur.it/anno-2000/ottobre/dm-04102000.aspx (26 febbraio 2018)
in scheme: subject-disciplines
notation: 003.005
preferred label: astronomy and astrophysics @en
related match: http://thes.bncf.firenze.sbn.it/termine.php
has rank order: 2