fisica per il sistema terra e il mezzo circumterrestre
type: Concept
broader: 003
definition: Comprende le competenze necessarie alla definizione e al perfezionamento di metodologie fisiche e fisico-matematiche per lo studio della Terra solida e della Terra fluida e delle loro interazioni dinamiche, compresi i processi fisici di diffusione e turbolenza, del mezzo circumterrestre (incluse atmosfera, magnetosfera), delle interazioni tra sistema Terra e sistema solare e della fisica del sistema climatico terrestre. Comprende anche le competenze atte alla progettazione, sviluppo e perfezionamento delle strumentazioni per le indagini sui macrosistemi terrestri e circumterrestri, nonché le competenze necessarie al perfezionamento e allo sviluppo delle metodiche di raccolta, trattazione e specifica interpretazione dei dati e della loro descrizione teorico-matematica.
editorial note: Fonte: Decreto Ministeriale 4 ottobre 2000 [In rete] http://attiministeriali.miur.it/anno-2000/ottobre/dm-04102000.aspx (26 febbraio 2018)
in scheme: subject-disciplines
notation: 003.007
preferred label: physics of the earth and of the circumterrestrial medium @en
has rank order: 2