didattica e storia della fisica
type: Concept
broader: https://w3id.org/italia/controlled-vocabulary/classifications-for-culture/subject-disciplines/003
notation: 003.009
editorial note: Fonte: Decreto Ministeriale 4 ottobre 2000 [In rete] http://attiministeriali.miur.it/anno-2000/ottobre/dm-04102000.aspx (26 febbraio 2018)
has rank order: 2
definition: Comprende le competenze necessarie allo studio della storia della fisica a partire dalle origini delle idee fisiche e allo studio e allo sviluppo delle metodiche didattiche e di trasferimento dei concetti fondamentali e delle conoscenze della fisica. Le competenze di questo settore riguardano anche le problematiche storiche, epistemologiche e didattiche connesse con i fondamenti della fisica classica e moderna.
preferred label: didactics and history of physics @en
in scheme: subject-disciplines