chimica fisica
type: Concept
related match: chimica fisica
broader: https://w3id.org/italia/controlled-vocabulary/classifications-for-culture/subject-disciplines/004
notation: 004.002
in scheme: subject-disciplines
editorial note: Fonte: Decreto Ministeriale 4 ottobre 2000 [In rete] http://attiministeriali.miur.it/anno-2000/ottobre/dm-04102000.aspx (26 febbraio 2018)
has rank order: 2
preferred label: physical chemistry @en
definition: La Chimica Fisica si prefigge di descrivere, sia a livello macroscopico sia a livello atomico-molecolare, la struttura, le proprietà e le trasformazioni della materia. Basandosi sempre più sullo sviluppo di metodologie sperimentali e di calcolo, mira alla costruzione di modelli di interpretazione e di previsione di parametri sperimentali e alla soluzione di problematiche relative a sistemi complessi di interesse chimico, fisico, biologico, ambientale e dei materiali. Si interessa anche di Didattica e Storia della Chimica.
related match: http://thes.bncf.firenze.sbn.it/termine.php