chimica industriale
type: Concept
broader: 004
definition: La Chimica Industriale raggruppa le competenze necessarie allo sviluppo di prodotti chimici, di materiali e di processi. Esse riguardano pertanto: 1) lo studio degli aspetti termodinamici, cinetici, catalitici e tecnologici correlati alla sintesi dei prodotti chimici di interesse industriale, allo sviluppo industriale, all'ottimizzazione e alla conduzione dei processi e alle relative problematiche di impatto ambientale e sicurezza; 2) la valorizzazione di materie prime rinnovabili attraverso lo studio dei processi biotecnologici e dei processi alternativi a basso impatto ambientale.
editorial note: Fonte: Decreto Ministeriale 4 ottobre 2000 [In rete] http://attiministeriali.miur.it/anno-2000/ottobre/dm-04102000.aspx (26 febbraio 2018)
in scheme: subject-disciplines
notation: 004.004
preferred label: industrial chemistry @en
related match: http://thes.bncf.firenze.sbn.it/termine.php
has rank order: 2