scienza e tecnologia dei materiali polimerici
type: Concept
broader: https://w3id.org/italia/controlled-vocabulary/classifications-for-culture/subject-disciplines/004
notation: 004.005
editorial note: Fonte: Decreto Ministeriale 4 ottobre 2000 [In rete] http://attiministeriali.miur.it/anno-2000/ottobre/dm-04102000.aspx (26 febbraio 2018)
has rank order: 2
definition: Il settore riguarda lo studio delle proprietà chimiche e tecnologiche dei materiali polimerici, della loro caratterizzazione in vista delle prestazioni e del ciclo di vita, della relazione proprietà-struttura, nonché delle proprietà dei biopolimeri anche in vista del loro impiego.
preferred label: science and technology of polymeric materials @en
in scheme: subject-disciplines