chimica organica
type: Concept
broader: 004
definition: La Chimica Organica si occupa dei composti del Carbonio, sia di origine naturale sia sintetica, sviluppando metodologie di sintesi efficienti, (stereo)selettive, catalitiche e rispettose dell'ambiente. Sono inoltre oggetto di studio l'elucidazione dei meccanismi attraverso i quali i composti organici si formano e si trasformano in laboratorio e nei sistemi naturali e ambientali, le loro interazioni supramolecolari e le relazioni struttura-reattività, la progettazione della sintesi e la realizzazione di nuovi catalizzatori, di composti biologicamente attivi e di nuovi materiali organici. Si interessa anche di Didattica e Storia della Chimica.
editorial note: Fonte: Decreto Ministeriale 4 ottobre 2000 [In rete] http://attiministeriali.miur.it/anno-2000/ottobre/dm-04102000.aspx (26 febbraio 2018)
in scheme: subject-disciplines
notation: 004.006
preferred label: organic chemistry @en
related match: chimica organica
related match: http://thes.bncf.firenze.sbn.it/termine.php
has rank order: 2