fondamenti chimici delle tecnologie
type: Concept
broader: https://w3id.org/italia/controlled-vocabulary/classifications-for-culture/subject-disciplines/004
notation: 004.007
editorial note: Fonte: Decreto Ministeriale 4 ottobre 2000 [In rete] http://attiministeriali.miur.it/anno-2000/ottobre/dm-04102000.aspx (26 febbraio 2018)
has rank order: 2
definition: Il settore è orientato allo studio dei fondamenti chimici e chimico-fisici dei diversi settori delle tecnologie, con particolare riguardo a quelli che si riferiscono ai materiali, alle loro proprietà e alla loro interazione con l'ambiente, fornendo una sintesi dei principi comuni alle diverse fenomenologie e alle diverse categorie di sostanze.
preferred label: chemical foundations of technologies @en
in scheme: subject-disciplines