chimica farmaceutica
type: Concept
broader: 004
definition: La Chimica Farmaceutica studia i prodotti di origine naturale, biotecnologica e sintetica dotati di attività biologica, sviluppando la progettazione, la sintesi, lo studio delle proprietà, dei meccanismi di azione a livello molecolare e degli aspetti chimico-tossicologici, l'utilizzazione e le relazioni fra struttura chimica e attività biologica delle principali classi di farmaci. Sono inoltre oggetto di studio le preparazioni estrattive e sintetiche dei farmaci, l'analisi delle sostanze aventi attività biologica e in particolare dei medicinali e dei loro metaboliti.
editorial note: Fonte: Decreto Ministeriale 4 ottobre 2000 [In rete] http://attiministeriali.miur.it/anno-2000/ottobre/dm-04102000.aspx (26 febbraio 2018)
in scheme: subject-disciplines
notation: 004.008
preferred label: pharmaceutical chemistry @en
related match: http://thes.bncf.firenze.sbn.it/termine.php
has rank order: 2