chimica dell'ambiente e dei beni culturali
type: Concept
alternative label: chimica ambientale
broader: 004
definition: Il settore si interessa del destino dei prodotti chimici naturali e di sintesi e del loro impatto sull’ambiente e sui beni culturali. Argomenti fondamentali sono: lo studio dei parametri chimici e chimico-fisici che riguardano l’ambiente e la chimica dello inquinamento; la promozione delle conoscenze chimiche e tecnologiche per la caratterizzazione, conservazione, restauro e recupero dei beni culturali. Nell’ambito del trattamento dei rifiuti in genere sviluppa le conoscenze chimiche e tecnologiche per il loro recupero e riciclo.
editorial note: Fonte: Decreto Ministeriale 4 ottobre 2000 [In rete] http://attiministeriali.miur.it/anno-2000/ottobre/dm-04102000.aspx (26 febbraio 2018)
in scheme: subject-disciplines
notation: 004.012
preferred label: chemistry for the environment and for cultural heritage @en
related match: http://thes.bncf.firenze.sbn.it/termine.php
has rank order: 2