paleontologia e paleoecologia
type: Concept
editorial note: Fonte: Decreto Ministeriale 4 ottobre 2000 [In rete] http://attiministeriali.miur.it/anno-2000/ottobre/dm-04102000.aspx (26 febbraio 2018)
related match: http://thes.bncf.firenze.sbn.it/termine.php
alternative label: paleontologia
alternative label: paleoecologia
alternative label: palaeontology and palaeoecology @en
notation: 005.001
in scheme: subject-disciplines
broader: https://w3id.org/italia/controlled-vocabulary/classifications-for-culture/subject-disciplines/005
has rank order: 2
preferred label: paleontology and paleoecology @en
definition: Il settore si occupa dello studio della vita nel passato geologico al fine di ricostruirne la storia, di interpretare e di collocare nel tempo gli eventi e i processi evolutivi alla luce delle testimonianze fossili, costituite da resti organici e da tracce di attività. Ha per compito l'inquadramento sistematico e filogenetico dei fossili, la ricostruzione nello spazio e nel tempo delle paleocomunità e dei loro rapporti, lo studio dei meccanismi di preservazione e l'analisi del ruolo sedimentogenetico. Le principali applicazioni riguardano l'utilizzo dei fossili come indicatori di età e di ambiente, al fine della costruzione delle scale-tempo e della ricostruzione paleoambientale, paleoclimatica, paleoceanografica e paleogeografica. Analizza inoltre le grandi crisi biologiche al fine di interpretare i cambiamenti globali con riferimento anche a quelli recenti. Si occupa delle tecniche di recupero, conservazione, gestione e fruizione dei beni paleontologici sul territorio e nelle strutture museali, della museologia naturalistica, della educazione scientifica e della didattica delle geoscienze.