geologia strutturale
type: Concept
notation: 005.004
related match: http://thes.bncf.firenze.sbn.it/termine.php
has rank order: 2
definition: Il settore si occupa dello studio dei processi della dinamica interna della Terra e dei pianeti, delle modificazioni indotte nelle unità geologiche superficiali e profonde, con la determinazione delle condizioni al contorno delle relazioni tra i campi di sforzo e i tipi di deformazione elastica e anelastica; del rilevamento e della ricostruzione tridimensionale di strutture geologiche complesse a varie scale e della loro evoluzione anche attraverso l'integrazione con i dati forniti dagli altri campi delle Scienze della Terra. Il settore si dedica, anche attraverso laboratori sperimentali, all'analisi, con vari metodi fisici, dei processi di deformazione e alla costruzione di modelli numerici e modelli analogici per la rappresentazione, anche cartografica, e per l'interpretazione dei processi deformativi alle varie scale e alle diverse profondità. Il settore si avvale di metodologie informatiche e tecniche di telerilevamento e fotointerpretazione. Partecipa alle applicazioni geologiche nel campo ambientale e di valutazione di impatto, nella mitigazione dei rischi naturali, nel reperimento di georisorse, nella gestione dei beni naturali, nella educazione scientifica e nella didattica delle geoscienze.
in scheme: subject-disciplines
editorial note: Fonte: Decreto Ministeriale 4 ottobre 2000 [In rete] http://attiministeriali.miur.it/anno-2000/ottobre/dm-04102000.aspx (26 febbraio 2018)
preferred label: structural geology @en
broader: https://w3id.org/italia/controlled-vocabulary/classifications-for-culture/subject-disciplines/005