mineralogia
type: Concept
definition: Il settore si occupa dello studio dei minerali, dei loro corrispondenti sintetici e, in genere, dei materiali cristallini e amorfi, allo scopo di determinarne la variabilità strutturale e composizionale, le trasformazioni in diverse condizioni ambientali, i processi genetici e di crescita, anche in relazione agli aspetti applicativi e mediante ricerche analitiche, cristallografiche, cristallochimiche e sperimentali. I contenuti del settore sono essenziali per la comprensione dei materiali naturali, dell'evoluzione e della struttura della Terra e di altri corpi planetari. Trovano inoltre espressione efficace nella museologia naturalistica, nella gestione dei beni naturali, nell'educazione scientifica e nella didattica delle geoscienze.
notation: 005.008
related match: mineralogia
related match: http://thes.bncf.firenze.sbn.it/termine.php
has rank order: 2
editorial note: Fonte: Decreto Ministeriale 4 ottobre 2000 [In rete] http://attiministeriali.miur.it/anno-2000/ottobre/dm-04102000.aspx (26 febbraio 2018)
in scheme: subject-disciplines
broader: https://w3id.org/italia/controlled-vocabulary/classifications-for-culture/subject-disciplines/005
preferred label: mineralogy @en