petrologia e petrografia
type: Concept
alternative label: petrografia
alternative label: petrologia
broader: 005
definition: Il settore copre i seguenti campi di competenza: struttura, composizione, origine e sistematica delle rocce ignee, metamorfiche e sedimentarie; significato petrogenetico e geodinamico delle associazioni petrografiche; interpretazione in chiave termodinamica e modellizzazione dei processi petrogenetici, anche con studi sperimentali, sulla stabilità delle associazioni di minerali nelle rocce e nei magmi; caratterizzazione petrochimica e petrofisica delle rocce; rilevamenti e studi petrogenetico-strutturali di complessi ignei e metamorfici; studi applicativi con particolare riguardo alle rocce coerenti e incoerenti di interesse industriale, ambientale e culturale. I contenuti di cui sopra sono essenziali per la comprensione della struttura e dell'evoluzione della Terra e di altri corpi planetari. Trovano inoltre espressione efficace nella museologia naturalistica, nella gestione dei beni naturali, nell'educazione scientifica e nella didattica delle geoscienze.
editorial note: Fonte: Decreto Ministeriale 4 ottobre 2000 [In rete] http://attiministeriali.miur.it/anno-2000/ottobre/dm-04102000.aspx (26 febbraio 2018)
in scheme: subject-disciplines
notation: 005.009
preferred label: petrology and petrography @en
related match: http://thes.bncf.firenze.sbn.it/termine.php
has rank order: 2