geochimica e vulcanologia
type: Concept
editorial note: Fonte: Decreto Ministeriale 4 ottobre 2000 [In rete] http://attiministeriali.miur.it/anno-2000/ottobre/dm-04102000.aspx (26 febbraio 2018)
has rank order: 2
preferred label: geochemistry and volcanology @en
related match: http://thes.bncf.firenze.sbn.it/termine.php
related match: geochimica
definition: La Geochimica studia la genesi, la distribuzione e il comportamento degli elementi e dei nuclidi in natura e le loro applicazioni nelle Scienze della Terra, utilizzando i metodi della chimica e della chimica-fisica. La Vulcanologia studia ed interpreta le strutture vulcaniche sia in relazione all’origine e alla natura dei magmi che in funzione delle dinamiche di eruzione, di trasporto e di deposizione dei prodotti. Le competenze del settore, basate su approcci sperimentali e modellistici, sono essenziali nella comprensione e nella definizione geocronologica dei processi evolutivi della Terra solida, dell’idrosfera, dell’atmosfera e della biosfera. L’applicazione degli approcci geochimici e vulcanologici è determinante nella pianificazione dello sfruttamento delle risorse strategiche naturali, compresa l’energia geotermica, nel controllo e nella quantificazione dei processi di inquinamento dei suoli, dell’acqua e dell’aria e nella mitigazione dei rischi naturali. Il settore cura anche l’educazione scientifica e la didattica delle geoscienze.
alternative label: vulcanologia
alternative label: geochimica
in scheme: subject-disciplines
broader: https://w3id.org/italia/controlled-vocabulary/classifications-for-culture/subject-disciplines/005
notation: 005.011