georisorse minerarie e applicazioni mineralogico- petrografiche per l'ambiente ed i beni culturali
type: Concept
broader: https://w3id.org/italia/controlled-vocabulary/classifications-for-culture/subject-disciplines/005
notation: 005.013
editorial note: Fonte: Decreto Ministeriale 4 ottobre 2000 [In rete] http://attiministeriali.miur.it/anno-2000/ottobre/dm-04102000.aspx (26 febbraio 2018)
has rank order: 2
definition: Il settore studia: la prospezione, la modellizzazione, la valutazione geostatistica e geoeconomica, la valorizzazione delle materie prime minerali e la cartografia tematica; la caratterizzazione di minerali e rocce d'interesse industriale, dei loro analoghi sintetici e dei prodotti di trasformazione, la loro tecnologia, le applicazioni industriali; l'interazione con l'ambiente, le applicazioni archeometriche, la conservazione dei materiali lapidei utilizzati per opere d'interesse storico-artistico nonché il recupero ambientale. Il settore cura anche l'educazione scientifica e la didattica delle geoscienze.
preferred label: mining resources, mineralogic and petrographic applications for the environment and for cultural heritage @en
in scheme: subject-disciplines