botanica generale
type: Concept
editorial note: Fonte: Decreto Ministeriale 4 ottobre 2000 [In rete] http://attiministeriali.miur.it/anno-2000/ottobre/dm-04102000.aspx (26 febbraio 2018)
related match: http://thes.bncf.firenze.sbn.it/termine.php
broader: https://w3id.org/italia/controlled-vocabulary/classifications-for-culture/subject-disciplines/006
preferred label: general botany @en
has rank order: 2
notation: 006.001
in scheme: subject-disciplines
related match: botanica
definition: Il settore studia la Biologia dei Vegetali a tutti i livelli di organizzazione, includendo procarioti autotrofi, alghe e funghi, nonché le loro simbiosi. Di questi organismi la Botanica Generale approfondisce, teoricamente e sperimentalmente, gli aspetti dell'organizzazione strutturale e funzionale e il loro divenire, per stabilirne le relazioni e interpretarne, in chiave evolutiva, strutture e funzioni, nonché i meccanismi riproduttivi. Approfondisce le modalità con cui cellule e organi acquisiscono la capacità di svolgere funzioni specializzate e l'articolazione dei processi che portano alla formazione di organismi complessi e all'ottimizzazione del processo riproduttivo; mette in evidenza le relazioni fra aspetti citologici, ultrastrutturali, istologici, anatomici, morfologici, organografici, fisiologici e il ruolo dei metaboliti secondari, inquadrandoli nelle caratteristiche dell'ambiente di sviluppo, nonché le basi molecolari dello sviluppo dei vegetali, con particolare riguardo a embriologia e morfogenesi. Studia inoltre l'elaborazione e l'applicazione delle metodiche funzionali alle indagini di pertinenza e le applicazioni biotecnologiche relative.