botanica ambientale e applicata
type: Concept
broader: https://w3id.org/italia/controlled-vocabulary/classifications-for-culture/subject-disciplines/006
notation: 006.003
editorial note: Fonte: Decreto Ministeriale 4 ottobre 2000 [In rete] http://attiministeriali.miur.it/anno-2000/ottobre/dm-04102000.aspx (26 febbraio 2018)
has rank order: 2
definition: Il settore studia la distribuzione, le strategie adattative, l’uso delle risorse, le interrelazioni con l’ambiente dei viventi fotosintetici procarioti ed eucarioti, nonché i funghi, utilizzando i diversi approcci della botanica, della geobotanica, dell'ecologia vegetale, della biologia vegetale applicata e dell’ecologia del paesaggio, sia in termini di modelli sia in termini applicativi. Approfondisce le conoscenze sulla filogenesi e l'organizzazione morfo-funzionale delle piante spontanee e di interesse agrario, forestale, veterinario ed etnologico, nonché sui meccanismi attraverso i quali gli organismi crescono, si riproducono e interagiscono nel corso dello sviluppo, così come lo studio della diversità floristica e vegetazionale ai diversi livelli dell'organizzazione biologica e in condizioni pedoclimatiche differenti. Studia corologia, autoecologia, sinecologia e classificazione della vegetazione in termini fitocenografici, fitosociologici e sindinamici, nonché le interazioni funzionali e strutturali tra le diverse componenti del sistema ambientale a livello multitemporale e multispaziale anche in relazione alle alterazioni indotte dalle attività antropiche. Ulteriori competenze riguardano: l’aerobiologia, la definizione della qualità ambientale, la conservazione della natura, la valutazione d'impatto ambientale, gli aspetti floristico-vegetazionali della progettazione ambientale e l’educazione ambientale finalizzati allo studio della complessità ecologica e alla gestione compatibile e al monitoraggio delle risorse naturali, anche in relazione ai cambiamenti globali.
preferred label: environmental and applied botany @en
in scheme: subject-disciplines