ecologia
type: Concept
editorial note: Fonte: Decreto Ministeriale 4 ottobre 2000 [In rete] http://attiministeriali.miur.it/anno-2000/ottobre/dm-04102000.aspx (26 febbraio 2018)
has rank order: 2
preferred label: ecology @en
notation: 006.008
definition: Il settore si occupa delle relazioni degli organismi autotrofi ed eterotrofi - terrestri (inclusi gli organismi del suolo), marini e di acqua dolce - con il loro ambiente, con particolare riguardo a distribuzione, storia evolutiva, risposte all'ambiente fisico e interazioni tra organismi conspecifici ed eterospecifici. Capitoli basilari dell'ecologia sono: dinamica e regolazione delle popolazioni in funzione delle risorse e delle interazioni biotiche (predazione, competizione, parassitismo, simbiosi); comunità, meccanismi che ne regolano la diversità e ne determinano la variazione spazio-temporale; ecosistemi naturali, antropizzati, urbano-industriali e loro organizzazione nei sistemi di paesaggi; flusso di energia negli ecosistemi, cicli biogeochimici e ruolo in essi svolto dai microrganismi; risposte degli ecosistemi ai cambiamenti globali e alle alterazioni antropiche. Il settore cura anche i seguenti aspetti applicativi: conservazione e gestione degli ecosistemi, utilizzazione delle risorse biologiche, controllo di specie esotiche, strategie per il mantenimento della biodiversità e la sostenibilità della biosfera, ecotossicologia, indicatori della qualità ambientale, valutazione di impatto ambientale, aspetti ecologici del risanamento e recupero ambientale. Si occupa anche di formazione ed educazione ambientale e di aspetti metodologici relativi all'analisi dei sistemi ecologici, al monitoraggio, alla modellizzazione e alla rappresentazione di dati ecologici e ai sistemi informativi ambientali.
broader: https://w3id.org/italia/controlled-vocabulary/classifications-for-culture/subject-disciplines/006
related match: http://thes.bncf.firenze.sbn.it/termine.php
related match: ecologia
in scheme: subject-disciplines