antropologia
type: Concept
has rank order: 2
related match: http://thes.bncf.firenze.sbn.it/termine.php
preferred label: anthropology @en
broader: https://w3id.org/italia/controlled-vocabulary/classifications-for-culture/subject-disciplines/006
in scheme: subject-disciplines
editorial note: Fonte: Decreto Ministeriale 4 ottobre 2000 [In rete] http://attiministeriali.miur.it/anno-2000/ottobre/dm-04102000.aspx (26 febbraio 2018)
definition: Il settore studia la Storia Naturale dell'Uomo, considerandone l'origine e l'evoluzione fisica e bio-culturale. I campi di competenza sono: la tassonomia, l’etologia e l'evoluzione dei primati per comprendere l'evoluzione e la variabilità umana; la classificazione e l’analisi dei resti fossili degli Ominidi per ricostruire la filogenesi umana e per migliorare la comprensione dei processi e dei meccanismi che hanno prodotto l'evoluzione dell'uomo; la ricostruzione della storia del popolamento umano di specifiche aree geografiche attraverso lo studio della distribuzione di marcatori morfologici e molecolari; l'origine e l’evoluzione delle culture nei loro aspetti naturalistici e lo studio delle strategie di sussistenza; la paleodemografia e la biodemografia; l'archeo-antropologia, anche nei suoi aspetti molecolari; gli aspetti comparativi dello sviluppo ontogenetico dell'Uomo; le caratteristiche biologiche delle popolazioni umane viventi e i rispettivi adattamenti alle condizioni ambientali; le applicazioni anche nel campo ergonomico e museologico dell’Antropologia.
notation: 006.009