biochimica
type: Concept
definition: Il settore Biochimica studia la chimica della materia vivente a partire dalle sue basi propedeutiche, i processi biologici a livello molecolare, la struttura, le proprietà e le funzioni delle biomolecole, tra cui le proteine e gli acidi nucleici; i meccanismi molecolari e di regolazione di biotrasformazioni, catalisi enzimatica, metabolismo, fermentazioni, espressione e regolazione genica, trasduzione dei segnali, comunicazioni intra e intercellulari; i meccanismi biochimici delle funzioni delle cellule procariotiche, dei vegetali, degli animali e dell'uomo anche durante la crescita, differenziamento, sviluppo e apoptosi; l’enzimologia, la bioenergetica e la biochimica delle attività motorie e sportive; le interazioni biochimiche tra organismi e tra organismi e ambiente; la biochimica dell’ambiente, dell’inquinamento, dei beni culturali; la biochimica vegetale e delle piante officinali; le metodologie biochimiche per l’identificazione, caratterizzazione e analisi delle biomolecole, la biologia strutturale molecolare, la biocristallografia, la biofisica, la biochimica computazionale e bioinformatica; le tecnologie molecolari ricombinanti per ingegnerizzare proteine e organismi; la biochimica industriale, dei microrganismi, dei prodotti di origine biotecnologica e degli xenobiotici compresi i farmaci; le biotecnologie molecolari e ricombinanti e le applicazioni biochimiche e biotecnologiche offerte da tutte le competenze sopraelencate a livello di proteine, acidi nucleici, lipidi e zuccheri in campo medico, farmaceutico, agro-alimentare, veterinario, industriale e ambientale; le basi biochimiche degli stati patologici, dell'alimentazione e nutrizione dell'uomo e altri organismi; la scienza dell’alimentazione; gli aspetti biochimici comparativi e le specificità biochimiche di cellule, tessuti, organi, organismi uni e pluricellulari e uomo, la biochimica sistematica umana e la biochimica veterinaria sistematica e comparata.
in scheme: subject-disciplines
related match: http://thes.bncf.firenze.sbn.it/termine.php
editorial note: Fonte: Decreto Ministeriale 4 ottobre 2000 [In rete] http://attiministeriali.miur.it/anno-2000/ottobre/dm-04102000.aspx (26 febbraio 2018)
related match: biochimica
broader: https://w3id.org/italia/controlled-vocabulary/classifications-for-culture/subject-disciplines/006
has rank order: 2
notation: 006.011
preferred label: biochemistry @en