biochimica clinica e biologia molecolare clinica
type: Concept
broader: https://w3id.org/italia/controlled-vocabulary/classifications-for-culture/subject-disciplines/006
notation: 006.013
editorial note: Fonte: Decreto Ministeriale 4 ottobre 2000 [In rete] http://attiministeriali.miur.it/anno-2000/ottobre/dm-04102000.aspx (26 febbraio 2018)
has rank order: 2
definition: Il settore si occupa dello studio dei parametri biologici e biochimici in campioni biologici nonché in vivo, anche in rapporto a stati fisiopatologici e alla biochimica clinica della nutrizione e delle attività motorie, a diversi livelli di organizzazione strutturale, dalle singole molecole alle cellule, ai tessuti, agli organi, fino all’intero organismo sia nell’uomo sia negli animali. Il corpo dottrinario del settore comprende: lo studio degli indicatori delle alterazioni che sono alla base delle malattie genetiche ereditarie e acquisite; lo sviluppo, l’utilizzo e il controllo di qualità: a) metodologie di biologia molecolare clinica, di diagnostica molecolare e di biotecnologie ricombinanti anche ai fini della valutazione della predisposizione alle malattie, della diagnosi nonché del monitoraggio delle terapie anche geniche; b) di tecnologie strumentali anche automatizzate che consentono l’analisi quantitativa e qualitativa dei summenzionati parametri a livelli di sensibilità e specificità elevati; c) di tecnologie biochimico-molecolari legate alla diagnostica clinica umana e/o veterinaria e a quella ambientale relativa agli xenobiotici, ai residui e agli additivi anche negli alimenti.
preferred label: clinical biochemistry and molecular biology @en
in scheme: subject-disciplines